Reaction Details
TargetMu-type opioid receptor
LigandBDBM50173254
Substrate/Competitorn/a
Meas. Tech.ChEMBL_321477 (CHEMBL880418)
IC50 3550±n/a nM
Citation Bignan, GCBattista, KConnolly, PJOrsini, MJLiu, JMiddleton, SAReitz, AB Preparation of 3-spirocyclic indolin-2-ones as ligands for the ORL-1 receptor. Bioorg Med Chem Lett15:5022-6 (2005) 
 
Mu-type opioid receptor
Name:Mu-type opioid receptor
Type:G Protein-Coupled Receptor (GPCR)
Mol. Mass.:44789.51
Organism:Homo sapiens (Human)
Description:P35372
Residue:400
BDBM50173254
NameBDBM50173254
Synonyms:CHEMBL434944 | methyl 2-[1'-cyclooctylmethyl-2-oxospiro[2,3-dihydro-1H-indole-3,4'-(hexahydropyridine)]-1-yl]acetate
TypeSmall organic molecule
Emp. Form.C24H34N2O3
Mol. Mass.398.5384
SMILESCOC(=O)CN1C(=O)C2(CCN(CC3CCCCCCC3)CC2)c2ccccc12