Reaction Details
TargetKappa-type opioid receptor
LigandBDBM50173258
Substrate/Competitorn/a
Meas. Tech.ChEMBL_321481 (CHEMBL880422)
IC50>10000±n/a nM
Citation Bignan, GCBattista, KConnolly, PJOrsini, MJLiu, JMiddleton, SAReitz, AB Preparation of 3-spirocyclic indolin-2-ones as ligands for the ORL-1 receptor. Bioorg Med Chem Lett15:5022-6 (2005) 
 
Kappa-type opioid receptor
Name:Kappa-type opioid receptor
Type:G Protein-Coupled Receptor (GPCR)
Mol. Mass.:42648.76
Organism:Homo sapiens (Human)
Description:P41145
Residue:380
BDBM50173258
NameBDBM50173258
Synonyms:1'-cyclooctylmethyl-1-cyclopropylmethyl-6-methoxyspiro[2,3-dihydro-1H-indole-3,4'-(hexahydropyridine)]-2-one | CHEMBL197959
TypeSmall organic molecule
Emp. Form.C26H38N2O2
Mol. Mass.410.5921
SMILESCOc1ccc2c(c1)N(CC1CC1)C(=O)C21CCN(CC2CCCCCCC2)CC1