Reaction Details
TargetNociceptin receptor
LigandBDBM50173276
Substrate/Competitorn/a
Meas. Tech.ChEMBL_321553 (CHEMBL881967)
IC50 900±n/a nM
Citation Bignan, GCBattista, KConnolly, PJOrsini, MJLiu, JMiddleton, SAReitz, AB Preparation of 3-spirocyclic indolin-2-ones as ligands for the ORL-1 receptor. Bioorg Med Chem Lett15:5022-6 (2005) 
 
Nociceptin receptor
Name:Nociceptin receptor
Type:G Protein-Coupled Receptor (GPCR)
Mol. Mass.:40702.87
Organism:Homo sapiens (Human)
Description:P41146
Residue:370
BDBM50173276
NameBDBM50173276
Synonyms:CHEMBL380580 | methyl 2-[2-oxo-1'-perhydro-2-naphthalenylspiro[2,3-dihydro-1H-indole-3,4'-(hexahydropyridine)]-1-yl]acetate
TypeSmall organic molecule
Emp. Form.C25H34N2O3
Mol. Mass.410.5491
SMILESCOC(=O)CN1C(=O)C2(CCN(CC2)C2CCC3CCCCC3C2)c2ccccc12