Reaction Details
TargetMu-type opioid receptor
LigandBDBM50173253
Substrate/Competitorn/a
Meas. Tech.ChEMBL_321477 (CHEMBL880418)
IC50 1410±n/a nM
Citation Bignan, GCBattista, KConnolly, PJOrsini, MJLiu, JMiddleton, SAReitz, AB Preparation of 3-spirocyclic indolin-2-ones as ligands for the ORL-1 receptor. Bioorg Med Chem Lett15:5022-6 (2005) 
 
Mu-type opioid receptor
Name:Mu-type opioid receptor
Type:G Protein-Coupled Receptor (GPCR)
Mol. Mass.:44789.51
Organism:Homo sapiens (Human)
Description:P35372
Residue:400
BDBM50173253
NameBDBM50173253
Synonyms:2-[1'-cyclooctylmethyl-2-oxospiro[2,3-dihydro-1H-indole-3,4'-(hexahydropyridine)]-1-yl]ethyl acetate | CHEMBL373190
TypeSmall organic molecule
Emp. Form.C25H36N2O3
Mol. Mass.412.5649
SMILESCC(=O)OCCN1C(=O)C2(CCN(CC3CCCCCCC3)CC2)c2ccccc12