Reaction Details
TargetNociceptin receptor
LigandBDBM50173246
Substrate/Competitorn/a
Meas. Tech.ChEMBL_321553 (CHEMBL881967)
IC50 7400±n/a nM
Citation Bignan, GCBattista, KConnolly, PJOrsini, MJLiu, JMiddleton, SAReitz, AB Preparation of 3-spirocyclic indolin-2-ones as ligands for the ORL-1 receptor. Bioorg Med Chem Lett15:5022-6 (2005) 
 
Nociceptin receptor
Name:Nociceptin receptor
Type:G Protein-Coupled Receptor (GPCR)
Mol. Mass.:40702.87
Organism:Homo sapiens (Human)
Description:P41146
Residue:370
BDBM50173246
NameBDBM50173246
Synonyms:1'-cyclooctylmethyl-5-isopropyl-1-methylspiro[2,3-dihydro-1H-indole-3,4'-(hexahydropyridine)]-2-one | CHEMBL197895
TypeSmall organic molecule
Emp. Form.C25H38N2O
Mol. Mass.382.582
SMILESCC(C)c1ccc2N(C)C(=O)C3(CCN(CC4CCCCCCC4)CC3)c2c1