Reaction Details
TargetNociceptin receptor
LigandBDBM50173282
Substrate/Competitorn/a
Meas. Tech.ChEMBL_321553 (CHEMBL881967)
IC50 10000±n/a nM
Citation Bignan, GCBattista, KConnolly, PJOrsini, MJLiu, JMiddleton, SAReitz, AB Preparation of 3-spirocyclic indolin-2-ones as ligands for the ORL-1 receptor. Bioorg Med Chem Lett15:5022-6 (2005) 
 
Nociceptin receptor
Name:Nociceptin receptor
Type:G Protein-Coupled Receptor (GPCR)
Mol. Mass.:40702.87
Organism:Homo sapiens (Human)
Description:P41146
Residue:370
BDBM50173282
NameBDBM50173282
Synonyms:CHEMBL382086 | methyl 2-[1'-(2-butyloctyl)-2-oxospiro[2,3-dihydro-1H-indole-3,4'-(hexahydropyridine)]-1-yl]acetate
TypeSmall organic molecule
Emp. Form.C27H42N2O3
Mol. Mass.442.634
SMILESCCCCCCC(CCCC)CN1CCC2(CC1)C(=O)N(CC(=O)OC)c1ccccc21