Reaction Details
TargetProstaglandin G/H synthase 2
LigandBDBM50173289
Substrate/Competitorn/a
Meas. Tech.ChEMBL_322407 (CHEMBL871883)
IC50 2±n/a nM
Citation Toyokuni, TKumar, JSWalsh, JCShapiro, ATalley, JJPhelps, MEHerschman, HRBarrio, JRSatyamurthy, N Synthesis of 4-(5-[18F]fluoromethyl-3-phenylisoxazol-4-yl)benzenesulfonamide, a new [18F]fluorinated analogue of valdecoxib, as a potential radiotracer for imaging cyclooxygenase-2 with positron emission tomography. Bioorg Med Chem Lett15:4699-702 (2005) 
 
Prostaglandin G/H synthase 2
Name:Prostaglandin G/H synthase 2
Type:Protein
Mol. Mass.:69020.39
Organism:Mus musculus (Mouse)
Description:Q05769
Residue:604
BDBM50173289
NameBDBM50173289
Synonyms:2-Fluoro-4-(5-methyl-3-phenyl-isoxazol-4-yl)-benzenesulfonamide | CHEMBL363180
TypeSmall organic molecule
Emp. Form.C16H13FN2O3S
Mol. Mass.332.349
SMILESCc1onc(c1-c1ccc(c(F)c1)S(N)(=O)=O)-c1ccccc1