Reaction Details
TargetProteinase-activated receptor 1
LigandBDBM50173419
Substrate/Competitorn/a
Meas. Tech.ChEMBL_321545 (CHEMBL881483)
IC50 11.0±n/a nM
Citation Chackalamannil, SXia, YGreenlee, WJClasby, MDoller, DTsai, HAsberom, TCzarniecki, MAhn, HSBoykow, GFoster, CAgans-Fantuzzi, JBryant, MLau, JChintala, M Discovery of potent orally active thrombin receptor (protease activated receptor 1) antagonists as novel antithrombotic agents. J Med Chem48:5884-7 (2005) 
 
Proteinase-activated receptor 1
Name:Proteinase-activated receptor 1
Type:Protein
Mol. Mass.:47450.07
Organism:Homo sapiens (Human)
Description:P25116
Residue:425
BDBM50173419
NameBDBM50173419
Synonyms:(3R,3aS,4S,4aR,8aS,9aR)-3-Methyl-4-{(E)-2-[5-(3-trifluoromethyl-phenyl)-pyridin-2-yl]-vinyl}-decahydro-naphtho[2,3-c]furan-1-one (3R,3aS,4S,4aR,8aS,9aR,E)-3-methyl-4-(2-(5-(3-(trifluoromethyl)phenyl)pyridin-2-yl)vinyl)-decahydronaphtho[2,3-c]furan-1(3H)-one SCH-205831
TypeSmall organic molecule
Emp. Form.C27H28F3NO2
Mol. Mass.455.5119
SMILESC[C@H]1OC(=O)[C@@H]2C[C@@H]3CCCC[C@H]3[C@H](\C=C\c3ccc(cn3)-c3cccc(c3)C(F)(F)F)[C@H]12