Reaction Details
TargetProstaglandin D2 receptor 2
LigandBDBM50174355
Substrate/Competitorn/a
Meas. Tech.ChEMBL_320834 (CHEMBL871676)
Ki 2979±n/a nM
Citation Armer, REAshton, MRBoyd, EABrennan, CJBrookfield, FAGazi, LGyles, SLHay, PAHunter, MGMiddlemiss, DWhittaker, MXue, LPettipher, R Indole-3-acetic acid antagonists of the prostaglandin D2 receptor CRTH2. J Med Chem48:6174-7 (2005) 
 
Prostaglandin D2 receptor 2
Name:Prostaglandin D2 receptor 2
Type:Enzyme
Mol. Mass.:43295.45
Organism:Homo sapiens (Human)
Description:Q9Y5Y4
Residue:395
BDBM50174355
NameBDBM50174355
Synonyms:CHEMBL194019 | [1-(1,2-Dimethyl-1H-imidazole-4-sulfonyl)-5-fluoro-2-methyl-1H-indol-3-yl]-acetic acid
TypeSmall organic molecule
Emp. Form.C16H16FN3O4S
Mol. Mass.365.379
SMILESCc1nc(cn1C)S(=O)(=O)n1c(C)c(CC(O)=O)c2cc(F)ccc12