Reaction Details
TargetHistone-lysine N-methyltransferase EZH2
LigandBDBM50110357
Substrate/Competitorn/a
Meas. Tech.ChEMBL_2224729 (CHEMBL5138242)
IC50 2.0±n/a nM
Citation Talukdar, AMukherjee, ABhattacharya, D Fascinating Transformation of SAM-Competitive Protein Methyltransferase Inhibitors from Nucleoside Analogues to Non-Nucleoside Analogues. J Med Chem65:1662-1684 (2022) 
 
Histone-lysine N-methyltransferase EZH2
Name:Histone-lysine N-methyltransferase EZH2
Type:Protein
Mol. Mass.:85367.84
Organism:Homo sapiens (Human)
Description:Q15910
Residue:746
BDBM50110357
NameBDBM50110357
Synonyms:CHEMBL3605455
TypeSmall organic molecule
Emp. Form.C27H36N4O4S
Mol. Mass.512.664
SMILESCCS(=O)(=O)N1CCC(CC1)[C@@H](C)n1c(C)c(C(=O)NCc2c(C)cc(C)[nH]c2=O)c2ccccc12