Reaction Details
TargetHistamine H3 receptor
LigandBDBM50174613
Substrate/Competitorn/a
Meas. Tech.ChEMBL_320914 (CHEMBL881341)
Ki 0.4±n/a nM
Citation Sun, MZhao, CGfesser, GAThiffault, CMiller, TRMarsh, KWetter, JCurtis, MFaghih, REsbenshade, TAHancock, AACowart, M Synthesis and SAR of 5-amino- and 5-(aminomethyl)benzofuran histamine H3 receptor antagonists with improved potency. J Med Chem48:6482-90 (2005) 
 
Histamine H3 receptor
Name:Histamine H3 receptor
Type:G Protein-Coupled Receptor (GPCR)
Mol. Mass.:48607.98
Organism:Rattus norvegicus (rat)
Description:n/a
Residue:445
BDBM50174613
NameBDBM50174613
Synonyms:4-({2-[2-((R)-2-Methyl-pyrrolidin-1-yl)-ethyl]-benzofuran-5-ylmethyl}-amino)-pyridine-2,6-dicarbonitrile | CHEMBL194506
TypeSmall organic molecule
Emp. Form.C23H23N5O
Mol. Mass.385.4616
SMILESC[C@@H]1CCCN1CCc1cc2cc(CNc3cc(nc(c3)C#N)C#N)ccc2o1