Reaction Details
TargetHistamine H3 receptor
LigandBDBM50174637
Substrate/Competitorn/a
Meas. Tech.ChEMBL_320914 (CHEMBL881341)
Ki 0.35±n/a nM
Citation Sun, MZhao, CGfesser, GAThiffault, CMiller, TRMarsh, KWetter, JCurtis, MFaghih, REsbenshade, TAHancock, AACowart, M Synthesis and SAR of 5-amino- and 5-(aminomethyl)benzofuran histamine H3 receptor antagonists with improved potency. J Med Chem48:6482-90 (2005) 
 
Histamine H3 receptor
Name:Histamine H3 receptor
Type:G Protein-Coupled Receptor (GPCR)
Mol. Mass.:48607.98
Organism:Rattus norvegicus (rat)
Description:n/a
Residue:445
BDBM50174637
NameBDBM50174637
Synonyms:CHEMBL196294 | {2-[2-((R)-2-Methyl-pyrrolidin-1-yl)-ethyl]-benzofuran-5-yl}-(3-nitro-pyridin-2-yl)-amine
TypeSmall organic molecule
Emp. Form.C20H22N4O3
Mol. Mass.366.4137
SMILESC[C@@H]1CCCN1CCc1cc2cc(Nc3ncccc3[N+]([O-])=O)ccc2o1