Reaction Details
TargetEnoyl-acyl-carrier protein reductase
LigandBDBM50174753
Substrate/Competitorn/a
Meas. Tech.ChEMBL_326719 (CHEMBL858717)
IC50 370±n/a nM
Citation Freundlich, JSAnderson, JWSarantakis, DShieh, HMYu, MValderramos, JCLucumi, EKuo, MJacobs, WRFidock, DASchiehser, GAJacobus, DPSacchettini, JC Synthesis, biological activity, and X-ray crystal structural analysis of diaryl ether inhibitors of malarial enoyl acyl carrier protein reductase. Part 1: 4'-substituted triclosan derivatives. Bioorg Med Chem Lett15:5247-52 (2005) 
 
Enoyl-acyl-carrier protein reductase
Name:Enoyl-acyl-carrier protein reductase
Synonyms:n/a
Type:PROTEIN
Mol. Mass.:49770.86
Organism:Plasmodium falciparum
Description:ChEMBL_795989
Residue:432
BDBM50174753
NameBDBM50174753
TypeSmall organic molecule
Emp. Form.C18H13Cl2NO4S
Mol. Mass.410.271
SMILESOc1cc(Cl)ccc1Oc1ccc(NS(=O)(=O)c2ccccc2)cc1Cl