Reaction Details
TargetEnoyl-acyl-carrier protein reductase
LigandBDBM50174759
Substrate/Competitorn/a
Meas. Tech.ChEMBL_326719 (CHEMBL858717)
IC50 413±n/a nM
Citation Freundlich, JSAnderson, JWSarantakis, DShieh, HMYu, MValderramos, JCLucumi, EKuo, MJacobs, WRFidock, DASchiehser, GAJacobus, DPSacchettini, JC Synthesis, biological activity, and X-ray crystal structural analysis of diaryl ether inhibitors of malarial enoyl acyl carrier protein reductase. Part 1: 4'-substituted triclosan derivatives. Bioorg Med Chem Lett15:5247-52 (2005) 
 
Enoyl-acyl-carrier protein reductase
Name:Enoyl-acyl-carrier protein reductase
Synonyms:n/a
Type:PROTEIN
Mol. Mass.:49770.86
Organism:Plasmodium falciparum
Description:ChEMBL_795989
Residue:432
BDBM50174759
NameBDBM50174759
TypeSmall organic molecule
Emp. Form.C13H8Cl2N4O2
Mol. Mass.323.134
SMILESOc1cc(Cl)ccc1Oc1ccc(cc1Cl)-c1nnn[nH]1