Reaction Details
TargetEnoyl-acyl-carrier protein reductase
LigandBDBM50174775
Substrate/Competitorn/a
Meas. Tech.ChEMBL_326719 (CHEMBL858717)
IC50 120±n/a nM
Citation Freundlich, JSAnderson, JWSarantakis, DShieh, HMYu, MValderramos, JCLucumi, EKuo, MJacobs, WRFidock, DASchiehser, GAJacobus, DPSacchettini, JC Synthesis, biological activity, and X-ray crystal structural analysis of diaryl ether inhibitors of malarial enoyl acyl carrier protein reductase. Part 1: 4'-substituted triclosan derivatives. Bioorg Med Chem Lett15:5247-52 (2005) 
 
Enoyl-acyl-carrier protein reductase
Name:Enoyl-acyl-carrier protein reductase
Synonyms:n/a
Type:PROTEIN
Mol. Mass.:49770.86
Organism:Plasmodium falciparum
Description:ChEMBL_795989
Residue:432
BDBM50174775
NameBDBM50174775
TypeSmall organic molecule
Emp. Form.C13H7Cl2NO2
Mol. Mass.280.106
SMILESOc1cc(Cl)ccc1Oc1ccc(cc1Cl)C#N