Reaction Details
TargetCaspase-1
LigandBDBM50175328
Substrate/Competitorn/a
Meas. Tech.ChEMBL_326950 (CHEMBL860329)
IC50 1±n/a nM
Citation O'Neil, SVWang, YLaufersweiler, MCOppong, KASoper, DLWos, JAEllis, CDBaize, MWBosch, GKFancher, ANLu, WSuchanek, MKWang, RLDe, BDemuth, TP Synthesis and evaluation of novel 8,6-fused bicyclic peptidomimetic compounds as interleukin-1beta converting enzyme inhibitors. Bioorg Med Chem Lett15:5434-8 (2005) 
 
Caspase-1
Name:Caspase-1
Type:Enzyme
Mol. Mass.:45154.13
Organism:Homo sapiens (Human)
Description:P29466
Residue:404
BDBM50175328
NameBDBM50175328
Synonyms:(4S,7S,11aS)-benzyl 4-(((3S)-2-hydroxy-5-oxo-tetrahydrofuran-3-yl)carbamoyl)-7-benzamido-6-oxo-3,4,7,8,11,11a-hexahydro-1H-pyrazino[1,2-a]azocine-2(6H)-carboxylate | CHEMBL198644
TypeSmall organic molecule
Emp. Form.C30H32N4O8
Mol. Mass.576.5971
SMILESOC1OC(=O)C[C@@H]1NC(=O)[C@@H]1CN(C[C@@H]2C\C=C/C[C@H](NC(=O)c3ccccc3)C(=O)N12)C(=O)OCc1ccccc1