Reaction Details
TargetExtracellular calcium-sensing receptor
LigandBDBM50175374
Substrate/Competitorn/a
Meas. Tech.ChEMBL_326644 (CHEMBL863377)
IC50 270±n/a nM
Citation Gavai, AVVaz, RJMikkilineni, ABRoberge, JYLiu, YLawrence, RMCorte, JRYang, WBednarz, MDickson, JKMa, ZSeethala, RFeyen, JH Discovery of novel 1-arylmethyl pyrrolidin-2-yl ethanol amines as calcium-sensing receptor antagonists. Bioorg Med Chem Lett15:5478-82 (2005) 
 
Extracellular calcium-sensing receptor
Name:Extracellular calcium-sensing receptor
Type:Protein
Mol. Mass.:120663.13
Organism:Homo sapiens (Human)
Description:P41180
Residue:1078
BDBM50175374
NameBDBM50175374
Synonyms:(R)-2-chloro-6-(2-hydroxy-3-(methyl(2-methyl-1-(naphthalen-2-yl)propan-2-yl)amino)propoxy)benzonitrile | CHEMBL370811
TypeSmall organic molecule
Emp. Form.C25H27ClN2O2
Mol. Mass.422.947
SMILESCN(C[C@@H](O)COc1cccc(Cl)c1C#N)C(C)(C)Cc1ccc2ccccc2c1