Reaction Details
TargetExtracellular calcium-sensing receptor
LigandBDBM50175382
Substrate/Competitorn/a
Meas. Tech.ChEMBL_326644 (CHEMBL863377)
IC50 50±n/a nM
Citation Gavai, AVVaz, RJMikkilineni, ABRoberge, JYLiu, YLawrence, RMCorte, JRYang, WBednarz, MDickson, JKMa, ZSeethala, RFeyen, JH Discovery of novel 1-arylmethyl pyrrolidin-2-yl ethanol amines as calcium-sensing receptor antagonists. Bioorg Med Chem Lett15:5478-82 (2005) 
 
Extracellular calcium-sensing receptor
Name:Extracellular calcium-sensing receptor
Type:Protein
Mol. Mass.:120663.13
Organism:Homo sapiens (Human)
Description:P41180
Residue:1078
BDBM50175382
NameBDBM50175382
Synonyms:(S)-2-chloro-6-(2-hydroxy-3-(2-methyl-1-(naphthalen-2-yl)propan-2-ylamino)propoxy)benzonitrile | CHEMBL200311
TypeSmall organic molecule
Emp. Form.C24H25ClN2O2
Mol. Mass.408.921
SMILESCC(C)(Cc1ccc2ccccc2c1)NC[C@H](O)COc1cccc(Cl)c1C#N