Reaction Details
TargetEstrogen receptor
LigandBDBM50175413
Substrate/Competitorn/a
Meas. Tech.ChEMBL_326622 (CHEMBL863381)
IC50 8.5±n/a nM
Citation Chesworth, RWessel, MDHeyden, LMangano, FMZawistoski, MGegnas, LGalluzzo, DLefker, BCameron, KOTickner, JLu, BCastleberry, TAPetersen, DNBrault, APerry, PNg, OOwen, TAPan, LKe, HZBrown, TAThompson, DDDaSilva-Jardine, P Estrogen receptor beta selective ligands: discovery and SAR of novel heterocyclic ligands. Bioorg Med Chem Lett15:5562-6 (2005) 
 
Estrogen receptor
Name:Estrogen receptor
Type:Protein
Mol. Mass.:66230.44
Organism:Homo sapiens (Human)
Description:P03372
Residue:595
BDBM50175413
NameBDBM50175413
Synonyms:4-(4-phenyl-5-(trifluoromethyl)isoxazol-3-yl)phenol | CHEMBL200021
TypeSmall organic molecule
Emp. Form.C16H10F3NO2
Mol. Mass.305.2513
SMILESOc1ccc(cc1)-c1noc(c1-c1ccccc1)C(F)(F)F