Reaction Details
TargetC-C chemokine receptor type 4
LigandBDBM50175665
Substrate/Competitorn/a
Meas. Tech.ChEMBL_329112 (CHEMBL863428)
IC50 50±n/a nM
Citation Purandare, AVWan, HGao, ASomerville, JBurke, CVaccaro, WYang, XMcIntyre, KWPoss, MA Optimization of CCR4 antagonists: side-chain exploration. Bioorg Med Chem Lett16:204-7 (2005) 
 
C-C chemokine receptor type 4
Name:C-C chemokine receptor type 4
Type:Enzyme
Mol. Mass.:41406.41
Organism:Homo sapiens (Human)
Description:P51679
Residue:360
BDBM50175665
NameBDBM50175665
Synonyms:(R)-(4-(4-(2,4-dichlorobenzylamino)pyrimidin-2-yl)piperazin-1-yl)(piperidin-2-yl)methanone | CHEMBL372399
TypeSmall organic molecule
Emp. Form.C21H26Cl2N6O
Mol. Mass.449.377
SMILESClc1ccc(CNc2ccnc(n2)N2CCN(CC2)C(=O)[C@H]2CCCCN2)c(Cl)c1