Reaction Details
TargetInhibitor of nuclear factor kappa-B kinase subunit alpha
LigandBDBM50175688
Substrate/Competitorn/a
Meas. Tech.ChEMBL_327453 (CHEMBL859877)
IC50 200±n/a nM
Citation Waelchli, RBollbuck, BBruns, CBuhl, TEder, JFeifel, RHersperger, RJanser, PRevesz, LZerwes, HGSchlapbach, A Design and preparation of 2-benzamido-pyrimidines as inhibitors of IKK. Bioorg Med Chem Lett16:108-12 (2005) 
 
Inhibitor of nuclear factor kappa-B kinase subunit alpha
Name:Inhibitor of nuclear factor kappa-B kinase subunit alpha
Type:PROTEIN
Mol. Mass.:84642.21
Organism:Homo sapiens (Human)
Description:ChEMBL_327453
Residue:745
BDBM50175688
NameBDBM50175688
Synonyms:(4-(4-(benzo[b]thiophen-2-yl)pyrimidin-2-ylamino)phenyl)(4-(pyrrolidin-1-yl)piperidin-1-yl)methanone IKK-16
TypeSmall organic molecule
Emp. Form.C28H29N5OS
Mol. Mass.483.628
SMILESO=C(N1CCC(CC1)N1CCCC1)c1ccc(Nc2nccc(n2)-c2cc3ccccc3s2)cc1