Reaction Details
TargetMitogen-activated protein kinase 14
LigandBDBM50175751
Substrate/Competitorn/a
Meas. Tech.ChEMBL_328207 (CHEMBL863946)
IC50 5.2±n/a nM
Citation Bao, JHunt, JAMiao, SRupprecht, KMStelmach, JELiu, LRuzek, RDSinclair, PJPivnichny, JVHop, CEKumar, SZaller, DMShoop, WLO'neill, EAO'keefe, SJThompson, CMCubbon, RMWang, RZhang, WXThompson, JEDoherty, JB p38 MAP kinase inhibitors: metabolically stabilized piperidine-substituted quinolinones and naphthyridinones. Bioorg Med Chem Lett16:64-8 (2005) 
 
Mitogen-activated protein kinase 14
Name:Mitogen-activated protein kinase 14
Type:Serine/threonine-protein kinase
Mol. Mass.:41286.76
Organism:Homo sapiens (Human)
Description:Q16539
Residue:360
BDBM50175751
NameBDBM50175751
Synonyms:7-(1-tert-butylpiperidin-4-yl)-1-(2,6-dichlorophenyl)-5-(2,4-difluorophenyl)-1,6-naphthyridin-2(1H)-one | CHEMBL199625
TypeSmall organic molecule
Emp. Form.C29H27Cl2F2N3O
Mol. Mass.542.447
SMILESCC(C)(C)N1CCC(CC1)c1cc2n(-c3c(Cl)cccc3Cl)c(=O)ccc2c(n1)-c1ccc(F)cc1F