Reaction Details
TargetMitogen-activated protein kinase 14
LigandBDBM50175745
Substrate/Competitorn/a
Meas. Tech.ChEMBL_328205 (CHEMBL863917)
IC50 0.14±n/a nM
Citation Bao, JHunt, JAMiao, SRupprecht, KMStelmach, JELiu, LRuzek, RDSinclair, PJPivnichny, JVHop, CEKumar, SZaller, DMShoop, WLO'neill, EAO'keefe, SJThompson, CMCubbon, RMWang, RZhang, WXThompson, JEDoherty, JB p38 MAP kinase inhibitors: metabolically stabilized piperidine-substituted quinolinones and naphthyridinones. Bioorg Med Chem Lett16:64-8 (2005) 
 
Mitogen-activated protein kinase 14
Name:Mitogen-activated protein kinase 14
Type:Serine/threonine-protein kinase
Mol. Mass.:41286.76
Organism:Homo sapiens (Human)
Description:Q16539
Residue:360
BDBM50175745
NameBDBM50175745
Synonyms:7-(1-tert-butylpiperidin-4-yl)-1-(2,6-dichlorophenyl)-5-(2,4-difluorophenyl)quinolin-2(1H)-one | CHEMBL199679
TypeSmall organic molecule
Emp. Form.C30H28Cl2F2N2O
Mol. Mass.541.459
SMILESCC(C)(C)N1CCC(CC1)c1cc(-c2ccc(F)cc2F)c2ccc(=O)n(-c3c(Cl)cccc3Cl)c2c1