Reaction Details
TargetMitogen-activated protein kinase 14
LigandBDBM50175758
Substrate/Competitorn/a
Meas. Tech.ChEMBL_328206 (CHEMBL863945)
IC50 0.27±n/a nM
Citation Bao, JHunt, JAMiao, SRupprecht, KMStelmach, JELiu, LRuzek, RDSinclair, PJPivnichny, JVHop, CEKumar, SZaller, DMShoop, WLO'neill, EAO'keefe, SJThompson, CMCubbon, RMWang, RZhang, WXThompson, JEDoherty, JB p38 MAP kinase inhibitors: metabolically stabilized piperidine-substituted quinolinones and naphthyridinones. Bioorg Med Chem Lett16:64-8 (2005) 
 
Mitogen-activated protein kinase 14
Name:Mitogen-activated protein kinase 14
Type:Serine/threonine-protein kinase
Mol. Mass.:41286.76
Organism:Homo sapiens (Human)
Description:Q16539
Residue:360
BDBM50175758
NameBDBM50175758
Synonyms:7-(1-tert-butylpiperidin-4-yl)-5-(2-chloro-4-fluorophenyl)-1-(2,6-dichlorophenyl)quinolin-2(1H)-one | CHEMBL381632
TypeSmall organic molecule
Emp. Form.C30H28Cl3FN2O
Mol. Mass.557.914
SMILESCC(C)(C)N1CCC(CC1)c1cc(-c2ccc(F)cc2Cl)c2ccc(=O)n(-c3c(Cl)cccc3Cl)c2c1