Reaction Details
TargetMitogen-activated protein kinase 14
LigandBDBM50175760
Substrate/Competitorn/a
Meas. Tech.ChEMBL_328205 (CHEMBL863917)
IC50 0.3±n/a nM
Citation Bao, JHunt, JAMiao, SRupprecht, KMStelmach, JELiu, LRuzek, RDSinclair, PJPivnichny, JVHop, CEKumar, SZaller, DMShoop, WLO'neill, EAO'keefe, SJThompson, CMCubbon, RMWang, RZhang, WXThompson, JEDoherty, JB p38 MAP kinase inhibitors: metabolically stabilized piperidine-substituted quinolinones and naphthyridinones. Bioorg Med Chem Lett16:64-8 (2005) 
 
Mitogen-activated protein kinase 14
Name:Mitogen-activated protein kinase 14
Type:Serine/threonine-protein kinase
Mol. Mass.:41286.76
Organism:Homo sapiens (Human)
Description:Q16539
Residue:360
BDBM50175760
NameBDBM50175760
Synonyms:7-(1-tert-butylpiperidin-4-yl)-5-(2-chloro-4-fluorophenyl)-1-(2,6-difluorophenyl)quinolin-2(1H)-one | CHEMBL199484
TypeSmall organic molecule
Emp. Form.C30H28ClF3N2O
Mol. Mass.525.004
SMILESCC(C)(C)N1CCC(CC1)c1cc(-c2ccc(F)cc2Cl)c2ccc(=O)n(-c3c(F)cccc3F)c2c1