Reaction Details
TargetMitogen-activated protein kinase 14
LigandBDBM50175759
Substrate/Competitorn/a
Meas. Tech.ChEMBL_328207 (CHEMBL863946)
IC50 6.8±n/a nM
Citation Bao, JHunt, JAMiao, SRupprecht, KMStelmach, JELiu, LRuzek, RDSinclair, PJPivnichny, JVHop, CEKumar, SZaller, DMShoop, WLO'neill, EAO'keefe, SJThompson, CMCubbon, RMWang, RZhang, WXThompson, JEDoherty, JB p38 MAP kinase inhibitors: metabolically stabilized piperidine-substituted quinolinones and naphthyridinones. Bioorg Med Chem Lett16:64-8 (2005) 
 
Mitogen-activated protein kinase 14
Name:Mitogen-activated protein kinase 14
Type:Serine/threonine-protein kinase
Mol. Mass.:41286.76
Organism:Homo sapiens (Human)
Description:Q16539
Residue:360
BDBM50175759
NameBDBM50175759
Synonyms:7-(1-tert-butylpiperidin-4-yl)-5-(2-chlorophenyl)-1-(2,6-dichlorophenyl)-1,6-naphthyridin-2(1H)-one | CHEMBL424666
TypeSmall organic molecule
Emp. Form.C29H28Cl3N3O
Mol. Mass.540.911
SMILESCC(C)(C)N1CCC(CC1)c1cc2n(-c3c(Cl)cccc3Cl)c(=O)ccc2c(n1)-c1ccccc1Cl