Reaction Details
TargetMitogen-activated protein kinase 14
LigandBDBM50175761
Substrate/Competitorn/a
Meas. Tech.ChEMBL_328205 (CHEMBL863917)
IC50 0.38±n/a nM
Citation Bao, JHunt, JAMiao, SRupprecht, KMStelmach, JELiu, LRuzek, RDSinclair, PJPivnichny, JVHop, CEKumar, SZaller, DMShoop, WLO'neill, EAO'keefe, SJThompson, CMCubbon, RMWang, RZhang, WXThompson, JEDoherty, JB p38 MAP kinase inhibitors: metabolically stabilized piperidine-substituted quinolinones and naphthyridinones. Bioorg Med Chem Lett16:64-8 (2005) 
 
Mitogen-activated protein kinase 14
Name:Mitogen-activated protein kinase 14
Type:Serine/threonine-protein kinase
Mol. Mass.:41286.76
Organism:Homo sapiens (Human)
Description:Q16539
Residue:360
BDBM50175761
NameBDBM50175761
Synonyms:7-(1-tert-butylpiperidin-4-yl)-5-(2-chloro-4-fluorophenyl)-1-(2,6-dichlorophenyl)-1,6-naphthyridin-2(1H)-one | CHEMBL199291
TypeSmall organic molecule
Emp. Form.C29H27Cl3FN3O
Mol. Mass.558.902
SMILESCC(C)(C)N1CCC(CC1)c1cc2n(-c3c(Cl)cccc3Cl)c(=O)ccc2c(n1)-c1ccc(F)cc1Cl