Reaction Details
TargetGenome polyprotein
LigandBDBM50175868
Substrate/Competitorn/a
Meas. Tech.ChEMBL_328004 (CHEMBL862736)
Ki>500000±n/a nM
Citation Yin, ZPatel, SJWang, WLWang, GChan, WLRao, KRAlam, JJeyaraj, DANgew, XPatel, VBeer, DLim, SPVasudevan, SGKeller, TH Peptide inhibitors of Dengue virus NS3 protease. Part 1: Warhead. Bioorg Med Chem Lett16:36-9 (2005) 
 
Genome polyprotein
Name:Genome polyprotein
Type:PROTEIN
Mol. Mass.:379613.45
Organism:Dengue virus 2
Description:ChEMBL_328004
Residue:3391
BDBM50175868
NameBDBM50175868
Synonyms:Bz-Nle-Lys-Thr-Arg-H | CHEMBL199817
TypeSmall organic molecule
Emp. Form.C29H48N8O6
Mol. Mass.604.7414
SMILES[#6]-[#6]-[#6]-[#6]-[#6@H](-[#7]-[#6](=O)-c1ccccc1)-[#6](=O)-[#7]-[#6@@H](-[#6]-[#6]-[#6]-[#6]-[#7])-[#6](=O)-[#7]-[#6@@H](-[#6@@H](-[#6])-[#8])-[#6](=O)-[#7]-[#6@@H](-[#6]-[#6]-[#6]\[#7]=[#6](\[#7])-[#7])-[#6]=O