Reaction Details
TargetHeparanase
LigandBDBM50175939
Substrate/Competitorn/a
Meas. Tech.ChEMBL_327900 (CHEMBL869912)
IC50 270±n/a nM
Citation Pan, WMiao, HQXu, YJNavarro, ECTonra, JRCorcoran, ELahiji, AKussie, PKiselyov, ASWong, WCLiu, H 1-[4-(1H-Benzoimidazol-2-yl)-phenyl]-3-[4-(1H-benzoimidazol-2-yl)-phenyl]-urea derivatives as small molecule heparanase inhibitors. Bioorg Med Chem Lett16:409-12 (2005) 
 
Heparanase
Name:Heparanase
Type:PROTEIN
Mol. Mass.:61167.67
Organism:Homo sapiens (Human)
Description:ChEMBL_327900
Residue:543
BDBM50175939
NameBDBM50175939
Synonyms:1,3-bis-[4-(1H-benzoimidazol-2-yl)phenyl]urea | CHEMBL380606
TypeSmall organic molecule
Emp. Form.C27H20N6O
Mol. Mass.444.4873
SMILESO=C(Nc1ccc(cc1)-c1nc2ccccc2[nH]1)Nc1ccc(cc1)-c1nc2ccccc2[nH]1