Reaction Details
TargetMitogen-activated protein kinase 14
LigandBDBM50176007
Substrate/Competitorn/a
Meas. Tech.ChEMBL_327352 (CHEMBL863439)
IC50 20±n/a nM
Citation Revesz, LBlum, EDi Padova, FEBuhl, TFeifel, RGram, HHiestand, PManning, UNeumann, URucklin, G Pyrazoloheteroaryls: novel p38alpha MAP kinase inhibiting scaffolds with oral activity. Bioorg Med Chem Lett16:262-6 (2005) 
 
Mitogen-activated protein kinase 14
Name:Mitogen-activated protein kinase 14
Type:Enzyme
Mol. Mass.:41281.22
Organism:Mus musculus (mouse)
Description:The full-length open reading frame of murine p38 alpha was cloned and expressed in E. coli.. Soluble murine p38R was extracted from cell pellets and purified using ion-exchange chromatography.
Residue:360
BDBM50176007
NameBDBM50176007
Synonyms:3-(5-(3-amino-3-methylbut-1-ynyl)-2-methoxyphenyl)-N-(2,4-difluorophenyl)-1H-pyrazolo[3,4-b]pyridin-6-amine | CHEMBL200820
TypeSmall organic molecule
Emp. Form.C24H21F2N5O
Mol. Mass.433.4532
SMILESCOc1ccc(cc1-c1[nH]nc2nc(Nc3ccc(F)cc3F)ccc12)C#CC(C)(C)N