Reaction Details
TargetCannabinoid receptor 1
LigandBDBM50176401
Substrate/Competitorn/a
Meas. Tech.ChEMBL_333260 (CHEMBL859079)
Ki 28±n/a nM
Citation Carpino, PAGriffith, DASakya, SDow, RLBlack, SCHadcock, JRIredale, PAScott, DOFichtner, MWRose, CRDay, RDibrino, JButler, MDebartolo, DBDutcher, DGautreau, DLizano, JSO'connor, RESands, MAKelly-Sullivan, DWard, KM New bicyclic cannabinoid receptor-1 (CB1-R) antagonists. Bioorg Med Chem Lett16:731-6 (2005) 
 
Cannabinoid receptor 1
Name:Cannabinoid receptor 1
Type:G Protein-Coupled Receptor (GPCR)
Mol. Mass.:52868.96
Organism:Homo sapiens (Human)
Description:P21554
Residue:472
BDBM50176401
NameBDBM50176401
Synonyms:3-(2-chlorophenyl)-2-(4-chlorophenyl)-6-(2,2,2-trifluoroethyl)-2H-pyrazolo[4,3-d]pyrimidin-7(6H)-one | CHEMBL380937
TypeSmall organic molecule
Emp. Form.C19H11Cl2F3N4O
Mol. Mass.439.218
SMILESFC(F)(F)Cn1cnc2c(-c3ccccc3Cl)n(nc2c1=O)-c1ccc(Cl)cc1