Reaction Details
TargetCannabinoid receptor 2
LigandBDBM50176405
Substrate/Competitorn/a
Meas. Tech.ChEMBL_333261 (CHEMBL859080)
Ki>10000±n/a nM
Citation Carpino, PAGriffith, DASakya, SDow, RLBlack, SCHadcock, JRIredale, PAScott, DOFichtner, MWRose, CRDay, RDibrino, JButler, MDebartolo, DBDutcher, DGautreau, DLizano, JSO'connor, RESands, MAKelly-Sullivan, DWard, KM New bicyclic cannabinoid receptor-1 (CB1-R) antagonists. Bioorg Med Chem Lett16:731-6 (2005) 
 
Cannabinoid receptor 2
Name:Cannabinoid receptor 2
Type:G Protein-Coupled Receptor (GPCR)
Mol. Mass.:39690.94
Organism:Homo sapiens (Human)
Description:P34972
Residue:360
BDBM50176405
NameBDBM50176405
Synonyms:3-(2-chlorophenyl)-2-(4-chlorophenyl)-6-cyclohexyl-2H-pyrazolo[4,3-d]pyrimidin-7(6H)-one | CHEMBL201929
TypeSmall organic molecule
Emp. Form.C23H20Cl2N4O
Mol. Mass.439.337
SMILESClc1ccc(cc1)-n1nc2c(ncn(C3CCCCC3)c2=O)c1-c1ccccc1Cl