Reaction Details
TargetCannabinoid receptor 1
LigandBDBM50176406
Substrate/Competitorn/a
Meas. Tech.ChEMBL_333260 (CHEMBL859079)
Ki 12±n/a nM
Citation Carpino, PAGriffith, DASakya, SDow, RLBlack, SCHadcock, JRIredale, PAScott, DOFichtner, MWRose, CRDay, RDibrino, JButler, MDebartolo, DBDutcher, DGautreau, DLizano, JSO'connor, RESands, MAKelly-Sullivan, DWard, KM New bicyclic cannabinoid receptor-1 (CB1-R) antagonists. Bioorg Med Chem Lett16:731-6 (2005) 
 
Cannabinoid receptor 1
Name:Cannabinoid receptor 1
Type:G Protein-Coupled Receptor (GPCR)
Mol. Mass.:52868.96
Organism:Homo sapiens (Human)
Description:P21554
Residue:472
BDBM50176406
NameBDBM50176406
Synonyms:2-(2-chlorophenyl)-3-(4-chlorophenyl)-6-(piperidin-1-yl)-2H-pyrazolo[4,3-d]pyrimidin-7(6H)-one | CHEMBL201923
TypeSmall organic molecule
Emp. Form.C22H19Cl2N5O
Mol. Mass.440.325
SMILESClc1ccc(cc1)-c1n(nc2c1ncn(N1CCCCC1)c2=O)-c1ccccc1Cl