Reaction Details
TargetCannabinoid receptor 1
LigandBDBM50176409
Substrate/Competitorn/a
Meas. Tech.ChEMBL_333260 (CHEMBL859079)
Ki 4±n/a nM
Citation Carpino, PAGriffith, DASakya, SDow, RLBlack, SCHadcock, JRIredale, PAScott, DOFichtner, MWRose, CRDay, RDibrino, JButler, MDebartolo, DBDutcher, DGautreau, DLizano, JSO'connor, RESands, MAKelly-Sullivan, DWard, KM New bicyclic cannabinoid receptor-1 (CB1-R) antagonists. Bioorg Med Chem Lett16:731-6 (2005) 
 
Cannabinoid receptor 1
Name:Cannabinoid receptor 1
Type:G Protein-Coupled Receptor (GPCR)
Mol. Mass.:52868.96
Organism:Homo sapiens (Human)
Description:P21554
Residue:472
BDBM50176409
NameBDBM50176409
Synonyms:2-(2-chlorophenyl)-3-(4-chlorophenyl)-6-ethyl-2H-pyrazolo[4,3-d]pyrimidin-7(6H)-one | CHEMBL202419
TypeSmall organic molecule
Emp. Form.C19H14Cl2N4O
Mol. Mass.385.247
SMILESCCn1cnc2c(-c3ccc(Cl)cc3)n(nc2c1=O)-c1ccccc1Cl