Reaction Details
TargetCannabinoid receptor 2
LigandBDBM50176412
Substrate/Competitorn/a
Meas. Tech.ChEMBL_333261 (CHEMBL859080)
Ki>10000±n/a nM
Citation Carpino, PAGriffith, DASakya, SDow, RLBlack, SCHadcock, JRIredale, PAScott, DOFichtner, MWRose, CRDay, RDibrino, JButler, MDebartolo, DBDutcher, DGautreau, DLizano, JSO'connor, RESands, MAKelly-Sullivan, DWard, KM New bicyclic cannabinoid receptor-1 (CB1-R) antagonists. Bioorg Med Chem Lett16:731-6 (2005) 
 
Cannabinoid receptor 2
Name:Cannabinoid receptor 2
Type:G Protein-Coupled Receptor (GPCR)
Mol. Mass.:39690.94
Organism:Homo sapiens (Human)
Description:P34972
Residue:360
BDBM50176412
NameBDBM50176412
Synonyms:6-benzyl-2-(2-chlorophenyl)-3-(4-chlorophenyl)-2H-pyrazolo[4,3-d]pyrimidin-7(6H)-one | CHEMBL379667
TypeSmall organic molecule
Emp. Form.C24H16Cl2N4O
Mol. Mass.447.316
SMILESClc1ccc(cc1)-c1n(nc2c1ncn(Cc1ccccc1)c2=O)-c1ccccc1Cl