Reaction Details
TargetMetabotropic glutamate receptor 1
LigandBDBM50177078
Substrate/Competitorn/a
Meas. Tech.ChEMBL_430991 (CHEMBL916419)
IC50 23±n/a nM
Citation Zheng, GZBhatia, PDaanen, JKolasa, TPatel, MLatshaw, SEl Kouhen, OFChang, RUchic, MEMiller, LNakane, MLehto, SGHonore, MPMoreland, RBBrioni, JDStewart, AO Structure-activity relationship of triazafluorenone derivatives as potent and selective mGluR1 antagonists. J Med Chem48:7374-88 (2005) 
 
Metabotropic glutamate receptor 1
Name:Metabotropic glutamate receptor 1
Type:Enzyme
Mol. Mass.:132358.19
Organism:Homo sapiens (Human)
Description:Q13255
Residue:1194
BDBM50177078
NameBDBM50177078
Synonyms:9-Dimethylamino-3-(4-fluoro-phenyl)-3H-pyrido[3',2':4,5]thieno[3,2-d]pyrimidin-4-one CHEMBL225124
TypeSmall organic molecule
Emp. Form.C17H13FN4OS
Mol. Mass.340.375
SMILESCN(C)c1ccnc2sc3c(ncn(-c4ccc(F)cc4)c3=O)c12