Reaction Details
TargetMetabotropic glutamate receptor 5
LigandBDBM50177055
Substrate/Competitorn/a
Meas. Tech.ChEMBL_430990 (CHEMBL916418)
Ki 613±n/a nM
Citation Zheng, GZBhatia, PDaanen, JKolasa, TPatel, MLatshaw, SEl Kouhen, OFChang, RUchic, MEMiller, LNakane, MLehto, SGHonore, MPMoreland, RBBrioni, JDStewart, AO Structure-activity relationship of triazafluorenone derivatives as potent and selective mGluR1 antagonists. J Med Chem48:7374-88 (2005) 
 
Metabotropic glutamate receptor 5
Name:Metabotropic glutamate receptor 5
Type:Enzyme
Mol. Mass.:131900.14
Organism:Rattus norvegicus (Rat)
Description:P31424
Residue:1203
BDBM50177055
NameBDBM50177055
Synonyms:9-Dimethylamino-3-(3-ethyl-phenyl)-3H-pyrido[3',2':4,5]thieno[3,2-d]pyrimidin-4-one CHEMBL224084
TypeSmall organic molecule
Emp. Form.C19H18N4OS
Mol. Mass.350.437
SMILESCCc1cccc(c1)-n1cnc2c(sc3nccc(N(C)C)c23)c1=O