Reaction Details
TargetMetabotropic glutamate receptor 1
LigandBDBM50177065
Substrate/Competitorn/a
Meas. Tech.ChEMBL_430989 (CHEMBL916417)
Ki 4±n/a nM
Citation Zheng, GZBhatia, PDaanen, JKolasa, TPatel, MLatshaw, SEl Kouhen, OFChang, RUchic, MEMiller, LNakane, MLehto, SGHonore, MPMoreland, RBBrioni, JDStewart, AO Structure-activity relationship of triazafluorenone derivatives as potent and selective mGluR1 antagonists. J Med Chem48:7374-88 (2005) 
 
Metabotropic glutamate receptor 1
Name:Metabotropic glutamate receptor 1
Type:Enzyme Catalytic Domain
Mol. Mass.:133240.47
Organism:RAT
Description:metabotropic glutamate 1/2 0 RAT::P23385
Residue:1199
BDBM50177065
NameBDBM50177065
Synonyms:9-Dimethylamino-3-(2,4-dimethyl-phenyl)-3H-pyrido[3',2':4,5]thieno[3,2-d]pyrimidin-4-one CHEMBL224356
TypeSmall organic molecule
Emp. Form.C19H18N4OS
Mol. Mass.350.437
SMILESCN(C)c1ccnc2sc3c(ncn(-c4ccc(C)cc4C)c3=O)c12