Reaction Details
TargetMetabotropic glutamate receptor 5
LigandBDBM50177082
Substrate/Competitorn/a
Meas. Tech.ChEMBL_430990 (CHEMBL916418)
Ki 1180±n/a nM
Citation Zheng, GZBhatia, PDaanen, JKolasa, TPatel, MLatshaw, SEl Kouhen, OFChang, RUchic, MEMiller, LNakane, MLehto, SGHonore, MPMoreland, RBBrioni, JDStewart, AO Structure-activity relationship of triazafluorenone derivatives as potent and selective mGluR1 antagonists. J Med Chem48:7374-88 (2005) 
 
Metabotropic glutamate receptor 5
Name:Metabotropic glutamate receptor 5
Type:Enzyme
Mol. Mass.:131900.14
Organism:Rattus norvegicus (Rat)
Description:P31424
Residue:1203
BDBM50177082
NameBDBM50177082
Synonyms:9-dimethylamino-3-(1H-indazol-6-yl)-3H-5-thia-1,3,6-triazafluoren-4-one | CHEMBL225438
TypeSmall organic molecule
Emp. Form.C18H14N6OS
Mol. Mass.362.408
SMILESCN(C)c1ccnc2sc3c(ncn(-c4ccc5cn[nH]c5c4)c3=O)c12