Reaction Details
TargetPro-cathepsin H
LigandBDBM50177494
Substrate/Competitorn/a
Meas. Tech.ChEMBL_334150 (CHEMBL868301)
IC50 230±n/a nM
Citation Adkison, KKBarrett, DGDeaton, DNGampe, RTHassell, AMLong, STMcFadyen, RBMiller, ABMiller, LRPayne, JAShewchuk, LMWells-Knecht, KJWillard, DHWright, LL Semicarbazone-based inhibitors of cathepsin K, are they prodrugs for aldehyde inhibitors? Bioorg Med Chem Lett16:978-83 (2006) 
 
Pro-cathepsin H
Name:Pro-cathepsin H
Type:PROTEIN
Mol. Mass.:37402.31
Organism:Homo sapiens (Human)
Description:ChEMBL_1459870
Residue:335
BDBM50177494
NameBDBM50177494
Synonyms:CHEMBL204605 | {(S)-1-[(morpholine-4-carbonyl)-hydrazonomethyl]-pentyl}-carbamic acid (S)-1-methyl-2-phenyl-ethyl ester
TypeSmall organic molecule
Emp. Form.C21H32N4O4
Mol. Mass.404.5032
SMILESCCCC[C@H](NC(=O)O[C@@H](C)Cc1ccccc1)C=NNC(=O)N1CCOCC1