Reaction Details
TargetCathepsin K
LigandBDBM50148292
Substrate/Competitorn/a
Meas. Tech.ChEMBL_334148 (CHEMBL868299)
IC50 0.350000±n/a nM
Citation Adkison, KKBarrett, DGDeaton, DNGampe, RTHassell, AMLong, STMcFadyen, RBMiller, ABMiller, LRPayne, JAShewchuk, LMWells-Knecht, KJWillard, DHWright, LL Semicarbazone-based inhibitors of cathepsin K, are they prodrugs for aldehyde inhibitors? Bioorg Med Chem Lett16:978-83 (2006) 
 
Cathepsin K
Name:Cathepsin K
Type:Enzyme
Mol. Mass.:36975.68
Organism:Homo sapiens (Human)
Description:P43235
Residue:329
BDBM50148292
NameBDBM50148292
Synonyms:((S)-1-Formyl-pentyl)-carbamic acid 1-benzyl-cyclopentyl ester 1-(PHENYLMETHYL)CYCLOPENTYL[(1S)-1-FORMYLPENTYL]CARBAMATE | CHEMBL117658
TypeSmall organic molecule
Emp. Form.C19H27NO3
Mol. Mass.317.4226
SMILESCCCC[C@H](NC(=O)OC1(Cc2ccccc2)CCCC1)C=O