Reaction Details
TargetSodium-dependent serotonin transporter
LigandBDBM50135256
Substrate/Competitorn/a
Meas. Tech.ChEMBL_349601 (CHEMBL866278)
Ki 0.86±n/a nM
Citation Takeuchi, KKohn, TJHonigschmidt, NARocco, VPSpinazze, PGHemrick-Luecke, SKThompson, LKEvans, DCRasmussen, KKoger, DLodge, DMartin, LJShaw, JThrelkeld, PGWong, DT Advances toward new antidepressants beyond SSRIs: 1-aryloxy-3-piperidinylpropan-2-ols with dual 5-HT1A receptor antagonism/SSRI activities. Part 5. Bioorg Med Chem Lett16:2347-51 (2006) 
 
Sodium-dependent serotonin transporter
Name:Sodium-dependent serotonin transporter
Type:Multi-pass membrane protein
Mol. Mass.:70322.51
Organism:Homo sapiens (Human)
Description:P31645
Residue:630
BDBM50135256
NameBDBM50135256
Synonyms:(S)-1-((2S,4R)-4-(4-methoxybenzo[b]thiophen-2-yl)-2-methylpiperidin-1-yl)-3-(2-methyl-1H-indol-4-yloxy)propan-2-ol CHEMBL129053
TypeSmall organic molecule
Emp. Form.C27H32N2O3S
Mol. Mass.464.62
SMILESCOc1cccc2sc(cc12)[C@@H]1CCN(C[C@H](O)COc2cccc3[nH]c(C)cc23)[C@@H](C)C1