Reaction Details
TargetDNA helicase IV
LigandBDBM50177710
Substrate/Competitorn/a
Meas. Tech.ChEMBL_334855 (CHEMBL871172)
IC50 1400±n/a nM
Citation Dubaele, SJahnke, WSchoepfer, JFuchs, JChène, P Inhibition of DNA helicases with DNA-competitive inhibitors. Bioorg Med Chem Lett16:923-7 (2006) 
 
DNA helicase IV
Name:DNA helicase IV
Type:PROTEIN
Mol. Mass.:77988.86
Organism:Escherichia coli (strain K12)
Description:ChEMBL_334855
Residue:684
BDBM50177710
NameBDBM50177710
Synonyms:(3-acetylamino-5-oxo-5,11-dihydro-10-thia-dibenzo[a,d]cyclohepten-7-yl)-acetic acid | CHEMBL201975
TypeSmall organic molecule
Emp. Form.C18H15NO4S
Mol. Mass.341.381
SMILESCC(=O)Nc1ccc2CSc3ccc(CC(O)=O)cc3C(=O)c2c1