Reaction Details
TargetCathepsin K
LigandBDBM50410573
Substrate/Competitorn/a
Meas. Tech.ChEMBL_325792 (CHEMBL862698)
Ki 13000±n/a nM
Citation Palmer, JTBryant, CWang, DXDavis, DESetti, ELRydzewski, RMVenkatraman, STian, ZQBurrill, LCMendonca, RVSpringman, EMcCarter, JChung, TCheung, HJanc, JWMcGrath, MSomoza, JREnriquez, PYu, ZWStrickley, RMLiu, LVenuti, MCPercival, MDFalgueyret, JPPrasit, POballa, RRiendeau, DYoung, RNWesolowski, GRodan, SBJohnson, CKimmel, DBRodan, G Design and synthesis of tri-ring P3 benzamide-containing aminonitriles as potent, selective, orally effective inhibitors of cathepsin K. J Med Chem48:7520-34 (2005) 
 
Cathepsin K
Name:Cathepsin K
Type:Enzyme
Mol. Mass.:36879.51
Organism:Oryctolagus cuniculus (rabbit)
Description:n/a
Residue:329
BDBM50410573
NameBDBM50410573
Synonyms:CHEMBL200511
TypeSmall organic molecule
Emp. Form.C16H21N3O3
Mol. Mass.303.3562
SMILESCC(C)C[C@@H](NC(=O)OCc1ccccc1)C(=O)NCC#N