Reaction Details
TargetCathepsin K
LigandBDBM50410578
Substrate/Competitorn/a
Meas. Tech.ChEMBL_325792 (CHEMBL862698)
Ki 5.4±n/a nM
Citation Palmer, JTBryant, CWang, DXDavis, DESetti, ELRydzewski, RMVenkatraman, STian, ZQBurrill, LCMendonca, RVSpringman, EMcCarter, JChung, TCheung, HJanc, JWMcGrath, MSomoza, JREnriquez, PYu, ZWStrickley, RMLiu, LVenuti, MCPercival, MDFalgueyret, JPPrasit, POballa, RRiendeau, DYoung, RNWesolowski, GRodan, SBJohnson, CKimmel, DBRodan, G Design and synthesis of tri-ring P3 benzamide-containing aminonitriles as potent, selective, orally effective inhibitors of cathepsin K. J Med Chem48:7520-34 (2005) 
 
Cathepsin K
Name:Cathepsin K
Type:Enzyme
Mol. Mass.:36879.51
Organism:Oryctolagus cuniculus (rabbit)
Description:n/a
Residue:329
BDBM50410578
NameBDBM50410578
Synonyms:CHEMBL199014
TypeSmall organic molecule
Emp. Form.C25H24N4O3
Mol. Mass.428.4831
SMILESO=C(NC1(CCCCC1)C(=O)NCC#N)c1ccc(cc1)-c1ccc(cc1)-c1ccno1