Reaction Details
TargetCathepsin K
LigandBDBM50410593
Substrate/Competitorn/a
Meas. Tech.ChEMBL_325792 (CHEMBL862698)
Ki 6.1±n/a nM
Citation Palmer, JTBryant, CWang, DXDavis, DESetti, ELRydzewski, RMVenkatraman, STian, ZQBurrill, LCMendonca, RVSpringman, EMcCarter, JChung, TCheung, HJanc, JWMcGrath, MSomoza, JREnriquez, PYu, ZWStrickley, RMLiu, LVenuti, MCPercival, MDFalgueyret, JPPrasit, POballa, RRiendeau, DYoung, RNWesolowski, GRodan, SBJohnson, CKimmel, DBRodan, G Design and synthesis of tri-ring P3 benzamide-containing aminonitriles as potent, selective, orally effective inhibitors of cathepsin K. J Med Chem48:7520-34 (2005) 
 
Cathepsin K
Name:Cathepsin K
Type:Enzyme
Mol. Mass.:36879.51
Organism:Oryctolagus cuniculus (rabbit)
Description:n/a
Residue:329
BDBM50410593
NameBDBM50410593
Synonyms:CHEMBL197440
TypeSmall organic molecule
Emp. Form.C28H32F3N5O4S
Mol. Mass.591.645
SMILESFC(F)(F)CN1CCN(CC1)S(=O)(=O)c1ccc(cc1)-c1ccc(cc1)C(=O)NC1(CCCCC1)C(=O)NCC#N