Reaction Details
TargetVascular endothelial growth factor receptor 2
LigandBDBM50002584
Substrate/Competitorn/a
Meas. Tech.ChEMBL_326138 (CHEMBL864514)
IC50 5.7±n/a nM
Citation Wissner, AFloyd, MBJohnson, BDFraser, HIngalls, CNittoli, TDushin, RGDiscafani, CNilakantan, RMarini, JRavi, MCheung, KTan, XMusto, SAnnable, TSiegel, MMLoganzo, F 2-(Quinazolin-4-ylamino)-[1,4]benzoquinones as covalent-binding, irreversible inhibitors of the kinase domain of vascular endothelial growth factor receptor-2. J Med Chem48:7560-81 (2005) 
 
Vascular endothelial growth factor receptor 2
Name:Vascular endothelial growth factor receptor 2
Type:Receptor Tyrosine Kinase
Mol. Mass.:151510.97
Organism:Homo sapiens (Human)
Description:P35968
Residue:1356
BDBM50002584
NameBDBM50002584
Synonyms:CHEMBL2113192
TypeSmall organic molecule
Emp. Form.C22H23F2N3O7
Mol. Mass.479.4307
SMILESCOCCOc1cc2ncnc(NC3=CC(=O)C(OC(CF)CF)=C(OC)C3=O)c2cc1OC