Reaction Details
TargetVascular endothelial growth factor receptor 2
LigandBDBM50002594
Substrate/Competitorn/a
Meas. Tech.ChEMBL_326141 (CHEMBL862696)
IC50 5.8±n/a nM
Citation Wissner, AFloyd, MBJohnson, BDFraser, HIngalls, CNittoli, TDushin, RGDiscafani, CNilakantan, RMarini, JRavi, MCheung, KTan, XMusto, SAnnable, TSiegel, MMLoganzo, F 2-(Quinazolin-4-ylamino)-[1,4]benzoquinones as covalent-binding, irreversible inhibitors of the kinase domain of vascular endothelial growth factor receptor-2. J Med Chem48:7560-81 (2005) 
 
Vascular endothelial growth factor receptor 2
Name:Vascular endothelial growth factor receptor 2
Type:Receptor Tyrosine Kinase
Mol. Mass.:151510.97
Organism:Homo sapiens (Human)
Description:P35968
Residue:1356
BDBM50002594
NameBDBM50002594
Synonyms:CHEMBL2113186
TypeSmall organic molecule
Emp. Form.C27H23N5O6
Mol. Mass.513.5014
SMILESCOCCOc1cc2ncnc(NC3=CC(=O)C(Oc4ccc(cc4)-n4ccnc4)=CC3=O)c2cc1OC