Reaction Details
TargetVascular endothelial growth factor receptor 2
LigandBDBM4851
Substrate/Competitorn/a
Meas. Tech.ChEMBL_326138 (CHEMBL864514)
IC50 138±n/a nM
Citation Wissner, AFloyd, MBJohnson, BDFraser, HIngalls, CNittoli, TDushin, RGDiscafani, CNilakantan, RMarini, JRavi, MCheung, KTan, XMusto, SAnnable, TSiegel, MMLoganzo, F 2-(Quinazolin-4-ylamino)-[1,4]benzoquinones as covalent-binding, irreversible inhibitors of the kinase domain of vascular endothelial growth factor receptor-2. J Med Chem48:7560-81 (2005) 
 
Vascular endothelial growth factor receptor 2
Name:Vascular endothelial growth factor receptor 2
Type:Receptor Tyrosine Kinase
Mol. Mass.:151510.97
Organism:Homo sapiens (Human)
Description:P35968
Residue:1356
BDBM4851
NameBDBM4851
Synonyms:(4-chlorophenyl)-[4-(4-pyridylmethyl)phthalazin-1-yl]amine CGP 79787 CHEMBL75232 N-(4-chlorophenyl)-4-(pyridin-4-ylmethyl)phthalazin-1-amine PTK787 cid_151194
TypeSmall organic molecule
Emp. Form.C20H15ClN4
Mol. Mass.346.813
SMILESClc1ccc(Nc2nnc(Cc3ccncc3)c3ccccc23)cc1