Reaction Details
TargetVascular endothelial growth factor receptor 2
LigandBDBM50002446
Substrate/Competitorn/a
Meas. Tech.ChEMBL_326139 (CHEMBL864515)
IC50 21±n/a nM
Citation Wissner, AFloyd, MBJohnson, BDFraser, HIngalls, CNittoli, TDushin, RGDiscafani, CNilakantan, RMarini, JRavi, MCheung, KTan, XMusto, SAnnable, TSiegel, MMLoganzo, F 2-(Quinazolin-4-ylamino)-[1,4]benzoquinones as covalent-binding, irreversible inhibitors of the kinase domain of vascular endothelial growth factor receptor-2. J Med Chem48:7560-81 (2005) 
 
Vascular endothelial growth factor receptor 2
Name:Vascular endothelial growth factor receptor 2
Type:Receptor Tyrosine Kinase
Mol. Mass.:151510.97
Organism:Homo sapiens (Human)
Description:P35968
Residue:1356
BDBM50002446
NameBDBM50002446
Synonyms:CHEMBL2113172
TypeSmall organic molecule
Emp. Form.C19H18ClN3O6
Mol. Mass.419.816
SMILESCOCCOc1cc2ncnc(NC3=CC(=O)C(OC)=C(Cl)C3=O)c2cc1OC